{"text_format":"1","workbook":"xlsx","n_sheets":4,"sheets":["Standing Data","Financial Data","lists","results"],"not_rendered":{"charts":0,"images":0,"macros":1,"external_links":0,"defined_names":119,"comments":2,"pivot_tables":0},"unopened":[],"bounds":{"document_bytes":16777216,"sheet_cells":100000,"rows_first":2000,"rows_last":500,"rows_between":2000,"halvings":0,"cell_chars":16384,"cell_head_chars":4096},"cells_cut":0,"cells_raw":0,"read":"whole","date_system":"1900"}

{"sheet":"Standing Data","index":0,"n_rows":123,"n_cols":9,"rows_kept":123,"cut":false,"hidden":false,"merged":[[0,0,0,6]]}
["The Mutual Funds (Annual Returns) Regulations"]
["For use in Return FAR-016-22-03 (T001)",{"$f":"ValidationErrorCombined","v":"THE FORM IS INCOMPLETE. PLEASE COMPLETE ALL HIGHLIGHTED (YELLOW) CELLS."}]
["1. Identification","",""]
["Fund Name",1.1000000000000001]
["CIMA Certificate Number","1.2",null,{"$f":"IF(ISBLANK(C5),\"\",IF(OR(NOT(ISNUMBER(C5)),C5<0),\"Enter positive number only\",\"\"))","v":""}]
["Legal Entity Identifier (if applicable)","1.2.1"]
["Operating Structure","1.3"]
["Is this report for a Master fund, Regulated Feeder fund or Not applicable?","1.3.1"]
["Master Fund Information","","",""]
["Number of Feeder Funds","1.3.2",null,{"$f":"V1.3.2","v":""}]
["Are there direct investors into the Master Fund","1.3.3"]
["Please enter Feeder Fund Information in table below:"]
[]
[null,"1.3.4 Name of Feeder Fund","1.3.5 Country Of Domicile","1.3.6 Name of Regulator\n(if applicable)","1.3.7 Country of Regulator\n(if applicable)","1.3.8 CIMA Certificate Number\n(if applicable)","1.3.9 Legal Entity Identifier\n(if applicable)"]
["___Multiple_Row_Start___","___Multiple_Row_Start___","___Multiple_Row_Start___","___Multiple_Row_Start___","___Multiple_Row_Start___","___Multiple_Row_Start___","___Multiple_Row_Start___","___Multiple_Row_Start___"]
["1",null,null,null,null,null,null,"Delete Row"]
["___Multiple_Row___","___Multiple_Row___","___Multiple_Row___","___Multiple_Row___","___Multiple_Row___","___Multiple_Row___","___Multiple_Row___","___Multiple_Row___"]
["sequence","value","value","value","value","value","value"]
[2,null,null,null,null,null,null,"Delete Row"]
["Add Row"]
[]
["Feeder Fund Information","",""]
["Name of Master Fund","1.3.10"]
["CIMA Certificate Number of Master Fund (if applicable)","1.3.11"]
["Legal Entity Identifier of Master Fund (if applicable)","1.3.12"]
["Intentionally left blank","1.3.13"]
["Intentionally left blank","1.3.14"]
["Intentionally left blank","1.3.15"]
["Multi-Fund","",""]
["Number of Sub-Funds/Portfolios in Fund","1.3.16",null,{"$f":"V1.3.16","v":""}]
["Number of Sub-Funds/Portfolios included in this return","1.3.17",null,{"$f":"V1.3.17","v":""}]
[]
["1.3.18","Names of Sub-Funds/Portfolios in this return","Included in this return"]
["___Multiple_Row_Start___","___Multiple_Row_Start___","___Multiple_Row_Start___",null,"___Multiple_Row_Start___","___Multiple_Row_Start___","___Multiple_Row_Start___","___Multiple_Row_Start___","___Multiple_Row_Start___"]
[1,null,null,"Delete Row"]
["___Multiple_Row___","___Multiple_Row___","___Multiple_Row___","___Multiple_Row___"]
["sequence","value","value"]
[2,null,null,"Delete Row"]
["Add Row"]
[]
{"$rows_left_out":84}
{"sheet":"Financial Data","index":1,"n_rows":46,"n_cols":10,"rows_kept":46,"cut":false,"hidden":false,"merged":[[0,0,0,6]]}
["Summary Financial Information"]
["For use in Return FAR-016-22-03 (T001)",{"$f":"ValidationErrorCombined","v":"THE FORM IS INCOMPLETE. PLEASE COMPLETE ALL HIGHLIGHTED (YELLOW) CELLS."}]
["7. Reporting Period","","",{"$f":"IF(OR(Q7.2<Q7.1,Q7.2>=NOW()),\"Check Dates\",IF(Q7.1<DATE(2014,1,1),\"Check Dates\",\"\"))","v":"Check Dates"}]
["From","F07.1",null,"Correct date format to be used is “dd-MMM-yyyy” (eg. 06-May-2015)"]
["To","F07.2",null,"Correct date format to be used is “dd-MMM-yyyy” (eg. 06-May-2015)"]
["8. Summary Statement of Financial Position","",null,""]
["Total Assets (+)","F08.1",null,"Total Assets are entered as a positive value. If none, enter \"0\"."]
["Beginning Net Asset Value (+)","F08.2",null,"Beginning Net Asset Value is entered as a positive value. If none, enter \"0\"."]
["Total Subscriptions (+)","F08.3",null,"Subscriptions are entered as a positive value. If none, enter \"0\"."]
["Total Redemptions (-)","F08.4",null,"Redemptions are entered as a negative value. If none, enter \"0\"."]
["Total Dividends/Distributions (-)","F08.5",null,"Dividends/Distributions are entered as a negative value. If none, enter \"0\"."]
["Net Income/Loss (+/-)","F08.6",null,"Net Income is entered as a positive value. Net loss is entered as a negative value. If none, enter \"0\"."]
["Ending Net Asset Value","F08.7",null,{"$f":"C8+C9+C10+C11+C12","v":0},"F08.7 Ending Net Asset Value =  F08.2 + F08.3 + F08.4 + F08.5 + F08.6"]
["9. Asset Allocation","",null,""]
["Investment in Master Fund (+)","F09.1",null,"Assets are entered as a positive value. If none, enter “0”."]
["Long position equities (assets) (+)","F09.2",null,"Assets are entered as a positive value. If none, enter “0”."]
["Short position equities (liabilities) (-)","F09.3",null,"Liabilities are entered as a negative value.  If none, enter “0”."]
["Debt instruments (assets) (+)","F09.4",null,"Assets are entered as a positive value.  If none, enter “0”."]
["Short position debt instruments (liabilities) (-)","F09.5",null,"Liabilities are entered as a negative value.  If none, enter “0”."]
["Other funds (+)","F09.6",null,"Assets are entered as a positive value.  If none, enter “0”."]
["Money Market instruments (+)","F09.7",null,"Assets are entered as a positive value.  If none, enter “0”."]
["Derivatives (assets) (+)","F09.8",null,"Assets are entered as a positive value.  If none, enter “0”."]
["Derivatives (liabilities) (-)","F09.9",null,"Liabilities are entered as a negative value.  If none, enter “0”."]
["Other investments (assets) (+)","F09.10",null,"Assets are entered as a positive value.  If none, enter “0”."]
["Other investments (liabilities) (-)","F09.11",null,"Liabilities are entered as a negative value.  If none, enter “0”."]
["10. Intentionally left blank"]
["11. Leverage (%)","F11",null,{"$f":"IF(D13<>0,SUM(ABS(C15),ABS(C16),ABS(C17),ABS(C18),ABS(C19),ABS(C20),ABS(C21),ABS(C22),ABS(C23),ABS(C24),ABS(C25))/D13,0)","v":0}," (Absolute value of all positions)/Ending Net Asset Value i.e. (F09.1+F09.2+F09.3+F09.4+F09.5+F09.6+F09.7+F09.8+F09.9+F09.10+F09.11) / F08.7"]
[]
["","12. Allocation of  Equity & Debt Securities and Master Funds by Country"]
["","F12.1 Country",null,"F12.2 Equity Securities & Short-Positions","F12.3 Long-term Debt Securities & Short-Positions","F12.4 Short-term Debt Securities & Short-Positions","F12.5 Investment in Master Fund","Total"]
["___Multiple_Row_Start___","___Multiple_Row_Start___","___Multiple_Row_Start___","___Multiple_Row_Start___","___Multiple_Row_Start___","___Multiple_Row_Start___","___Multiple_Row_Start___","___Multiple_Row_Start___","___Multiple_Row_Start___","___Multiple_Row_Start___"]
[1,null,null,null,null,null,null,{"$f":"D32+E32+F32+G32","v":0},"Total = F12.2 + F12.3 + F12.4 + F12.5","Delete Row"]
["___Multiple_Row___","___Multiple_Row___","___Multiple_Row___","___Multiple_Row___","___Multiple_Row___","___Multiple_Row___","___Multiple_Row___","___Multiple_Row___","___Multiple_Row___","___Multiple_Row___"]
["sequence","value","value","value","value","value","value","formula"]
[2,null,null,null,null,null,null,{"$f":"D35+E35+F35+G35","v":0},"Total = F12.2 + F12.3 + F12.4 + F12.5","Delete Row"]
["Add Row"]
[]
[]
["13. Summary Expenses","","",""]
["Management (-)","F13.1",null,"Summary Expenses are entered as a negative values or if there were none during the period, enter “0”."]
{"$rows_left_out":7}
{"sheet":"lists","index":2,"n_rows":308,"n_cols":16,"rows_kept":308,"cut":false,"hidden":true,"merged":[]}
["1.3","1.3.1","Multiple","2.1.0","2.1.1","2.1.3","2.1.4","2.1.5","2.1.6","2.1.7","2.2i","2.5.1","2.8.1","2.8.2","4i","2.6.1"]
["Multi-Fund","Feeder Fund","Afghanistan","KYD Cayman Islands Dollars","Activism","Fund not listed","AAOIFI (Islamic Financial Institutions)","Australia","Less than 50,000","Ex-Special Economic Zone Company","Director","A.R.C. Directors Ltd [1001534]","Anchin, Block & Anchin (Cayman) Ltd.","Unqualified with no Emphasis of Matter","Afghanistan","AFA Legal Resources (Cayman) Ltd."]
["Single Fund","Master Fund","Albania","USD US Dollars","Aggressive Growth","Amman Stock Exchange","Australian Accounting Standard","Brazil","50,000 – 99,999","Ex-Unlimited Liability","General Partner","Abacus Management Limited [1002120]","Arthur Bell (Cayman)","Unqualified with an Emphasis of Matter - fair valued securities","Albania","Alric Jeremy Lindsay"]
[null,"Not Applicable","Algeria","EUR Euro","Arbitrage","Athens Exchange","Brazilian GAAP","Canada","100,000 – 499,999","Exempt Limited Partnership","Trustee","Advanced Fund Administration (Cayman) Ltd. [1006994]","Baker Tilly (Cayman) Ltd.","Unqualified with an Emphasis of Matter - wind-up of the Fund","Algeria","Appleby (Cayman) Ltd."]
[null,null,"American Samoa","JPY Japanese Yen","Asset-backed / Mortgage-backed security","Australian Securities Exchange","Canadian GAAP","France","500,000 – 999,999","Exempt Trust","Managing Member","Advantage International Management (Cayman) Ltd. [1115531]","BBD Cayman","Unqualified with an Emphasis of Matter - other","American Samoa","Boxalls"]
[null,null,"Andorra","GBP Pounds Sterling","Commodity Trading","BATS Exchange","French GAAP","Hong Kong","1,000,000 – 4,999,999","Exempted Company",null,"Aequitas International Management Ltd. [2686821]","BDO Cayman Ltd.","Qualified - accounting policy for organization costs","Andorra","Campbells"]
[null,null,"Angola","CHF Swiss Francs","Convertible Arbitrage","Bayerische Borse AG","Hong Kong FRS","International Standards on Auditing","5,000,000 – 9,999,999","Exempted Company - By way of Continuation",null,"AIMS Limited [1795205]","Berdon Cayman","Qualified - other","Angola","Carey Olsen"]
[null,null,"Anguilla","HKD Hong Kong Dollars","Dedicated Short","Berlin Stock Exchange","International Accounting Standards","Islamic","10,000,000 or more","Exempted Limited Duration Company ",null,"Alexandria Bancorp Limited [1016260]","Berman Fisher Limited","Adverse","Anguilla","Collas Crill"]
[null,null,"Antarctica","AUD Australia Dollars","Digital Assets","Bermuda Stock Exchange","International Financial Reporting Standards","Israel",null,"Foreign Company ",null,"Allied Irish Banks, Public Limited Company [1019395]","BPM Cayman","Disclaimer","Antarctica","Conyers Dill & Pearman (Cayman) Limited"]
[null,null,"Antigua and Barbuda","CAD Canada Dollars","Distressed Securities","BM&F Bovespa","Irish GAAP","Japan",null,"International Business Company",null,"ALPHAMETRIX360 (CAYMAN) LTD. [1495944]","CITRIN COOPERMAN (CAYMAN)",null,"Antigua and Barbuda","De Lima Associates Ltd."]
[null,null,"Argentina","ADP Andorran Peseta","Dynamic Trading Approach","BME Spanish Exchanges","Israeli GAAP ","Liechtenstein",null,"Limited Duration Company",null,"ALPS Alternative Investment Services, Ltd. [1297656]","COHEN & COMPANY (CAYMAN)",null,"Argentina","Dillon Eustace"]
[null,null,"Armenia","AED (United) Arab Emirates Dirham","Emerging Markets","BOAG Borsen AG","Japanese GAAP","Luxembourg",null,"Limited Liability Company",null,"Altajir Bank [1020832]","CohnReznick (Cayman)",null,"Armenia","Emburys"]
[null,null,"Aruba","ALL Albanian Lek","Equity Hedged ","Bolsa de Comercio de Buenos Aires","Luxembourg GAAP","Malaysia",null,"Limited Partnership",null,"Alter Domus Cayman Limited [2530010]","Crowe Horwath Cayman Ltd.",null,"Aruba","Etienne Blake"]
[null,null,"Australia","AMD Armenian Dram","Equity Long Only","Bolsa de Comercio de Santiago","Malaysia","Norwegian",null,"Non-Profit Company",null,"Amicorp Cayman Fiduciary Limited [2130730]","Deloitte & Touche",null,"Australia","Finab Legal Ltd."]
[null,null,"Austria","ANG (Netherlands) Antillian Guilder","Equity Market Neutral","Bolsa de Valores de Caracas","Norwegian","Singapore",null,"Open-Ended Investment Company",null,"AMS Corporate Services (Cayman) Limited [1784193]","EisnerAmper Cayman Ltd.",null,"Austria","Forbes Hare"]
[null,null,"Azerbaijan","AOA Angolan Kwanza","ESG (Environmental, Social and Governance)","Bolsa de Valores de Colombia","Singapore FRS","Switzerland",null,"Open-Ended Limited Partnership",null,"Ancova Limited [2613074]","EisnerAmper US (Cayman) Ltd.",null,"Azerbaijan","FrancisGrey"]
[null,null,"Bahamas","ARS Argentine Peso","Event Driven","Bolsa de Valores de Lima","Switzerland GAAP","UK and Ireland",null,"Ordinary Non-Resident",null,"Aon Insurance Managers (Cayman) Ltd. [1034331]","Elliott Davis Cayman Ltd.",null,"Bahamas","Harney Westwood & Riegels"]
[null,null,"Bahrain","AWG Aruban Florin (old guilder)","Fixed Income","Bombay Stock Exchange","UK GAAP","United States",null,"Ordinary Resident",null,"Aon Risk Solutions (Cayman) Ltd. [1034320]","ELLIOTT DAVIS DECOSIMO CAYMAN",null,"Bahrain","Higgs & Johnson"]
[null,null,"Bangladesh","BAM Bosnia and Herzegovina Convertible ","Fixed Income Arbitrage","Borsa Italiana SPA","US GAAP",null,null,"Partnership",null,"Apex Fund Services (Cayman) Ltd. [1784646]","Ernst & Young Ltd.",null,"Bangladesh","HSM Chambers"]
[null,null,"Barbados","BBD Barbados Dollar","Foreign Exchange","Bratislava Stock Exchange",null,null,null,"Segregated Portfolio Company",null,"Appleby Global Services (Cayman) Limited [2767284]","Grant Thornton",null,"Barbados","Jacob Law Ltd."]
[null,null,"Belarus","BDT Bangladeshi Taka","Fund of funds","Bucharest Stock Exchange",null,null,null,"Unit Trust",null,"Arcadia Group Ltd. [1036464]","Kaufman, Rossin & Co. Cayman",null,"Belarus","Loeb Smith"]
[null,null,"Belgium","BGN Bulgarian Lev","Fund of hedge funds ","Budapest Stock Exchange",null,null,null,null,null,"Armand International Fiduciary (Cayman) Limited [2414370]","KPMG",null,"Belgium","Maples and Calder - Cayman"]
[null,null,"Belize","BHD Bahraini Dinar","Funds of hedge funds ","Bulgarian Stock Exchange",null,null,null,null,null,"Artex Risk Solutions (Cayman No2) Limited [1839740]","Marcum (Cayman)",null,"Belize","McGrath Tonner"]
[null,null,"Benin","BIF Burundi Franc","Global Macro","Cayman Islands Stock Exchange",null,null,null,null,null,"Aston Corporate Managers, Ltd. [1043280]","Margolin, Winer & Evens (Cayman)",null,"Benin","Mourant Ozannes"]
[null,null,"Bermuda","BMD Bermudian Dollar","Insurance Linked Securities","Channel Islands Stock Exchange",null,null,null,null,null,"Athena International Management Limited [1043744]","Mayer Hoffman McCann (Cayman)",null,"Bermuda","Nelson & Company"]
[null,null,"Bhutan","BND Brunei Dollar","Long-only absolute return funds ","Chicago Board Options Exchange",null,null,null,null,null,"Aureum Reinsurance Company, Ltd. [2598864]","Mazars (Cayman)",null,"Bhutan","Ogier - Cayman"]
[null,null,"Bolivia","BOB Bolivian Boliviano","Long/Short Equity","Chicago Stock Exchange",null,null,null,null,null,"Avalon Trust & Corporate Services Ltd. [1085335]","MHA MacIntyre Hudson Cayman",null,"Bolivia","Paget-Brown & Company Ltd."]
[null,null,"Bonaire, Sint Eustatius and Saba","BRL Brazil Real","Macro Investment","CME Group",null,null,null,null,null,"Axiss International Management Ltd. [1047303]","Moore Stephens Cayman Ltd.",null,"Bonaire, Sint Eustatius and Saba","Priestleys, Attorneys-at-Law"]
[null,null,"Bosnia and Herzegovina","BRL Brazilian Real","Managed Futures","Colombo Stock Exchange",null,null,null,null,null,"Balboa Management Ltd. [2250345]","Moss Adams (Cayman) LP",null,"Bosnia and Herzegovina","Solomon Harris"]
[null,null,"Botswana","BTN Bhutan Ngultrum","Market Directional","Copenhagen Stock Exchange",null,null,null,null,null,"Banco Bilbao Vizcaya Argentaria, S.A. [1049123]","O'Connor Davies (Cayman)",null,"Botswana","Stuarts Walker Hersant Humphries"]
[null,null,"Brazil","BWP Botswana Pula","Market Neutral","Cyprus Stock Exchange",null,null,null,null,null,"Banco Bradesco S.A. [1049215]","PricewaterhouseCoopers",null,"Brazil","Travers Thorp Alberga"]
[null,null,"British Indian Ocean Territory","BYR Belarusian Ruble","Market Timing","Czech Stock Exchange",null,null,null,null,null,"Banco Santander (Brasil) S.A. [1049974]","Raich Ende Malter (Cayman)",null,"British Indian Ocean Territory","Turners"]
[null,null,"British Virgin Islands","BZD Belize Dollar","Merger Arbitrage","Deutsche Borse",null,null,null,null,null,"Bank Espirito Santo (International) Limited [1050383]","Rankin Berkower (Cayman) Ltd.",null,"British Virgin Islands","U Law Limited"]
[null,null,"Brunei Darussalam","CDF Congolese Franc","Multi-Manager ","Dusseldorf Stock Exchange",null,null,null,null,null,"Bank of Bermuda (Cayman) Limited [1050556]","Richey, May & Co. (Cayman)",null,"Brunei Darussalam","Walkers (Cayman)"]
[null,null,"Bulgaria","CLP Chilean Peso","Multi-Strategy","EDX London",null,null,null,null,null,"BBAM Reef Limited [1048025]","RSM Cayman Ltd",null,"Bulgaria","Other…"]
[null,null,"Burkina Faso","CNY China Yuan Renmimbi","Passive management / Index tracking","Eurex",null,null,null,null,null,"BEACON MANAGEMENT (CAYMAN) LTD. [2603786]","Russell Bedford (Cayman)",null,"Burkina Faso"]
[null,null,"Burundi","COP Colombian Peso","Private Equity","Euronext",null,null,null,null,null,"Bell Rock Corporate Services Limited [1975363]","Sandler & Company (Cayman)",null,"Burundi"]
[null,null,"Cambodia","CRC Costa Rican Colon","Real Estate ","Fukuoka Stock Exchange",null,null,null,null,null,"Bessemer Trust Company (Cayman) Limited [1058783]","Spicer Jeffries (Cayman)",null,"Cambodia"]
[null,null,"Cameroon","CUP Cuban Peso","Relative Value","Hong Kong Exchange and Clearing",null,null,null,null,null,"BNP Paribas Bank & Trust Cayman Limited [1064254]","Squar Milner (Cayman), Ltd.",null,"Cameroon"]
[null,null,"Canada","CVE Cape Verde Escudo","Statistical Arbitrage","Indonesia Stock Exchange",null,null,null,null,null,"BNP Paribas Fund Administration Services (Cayman) Limited [1788850]","Stout, Causey & Horning (Cayman)",null,"Canada : Alberta"]
{"$rows_left_out":269}
{"sheet":"results","index":3,"n_rows":28,"n_cols":13,"rows_kept":28,"cut":false,"hidden":true,"merged":[]}
["Feeder Fund row count:",1]
["Sub-Fund row count:",1,{"$f":"35+CountSubFunds-1","v":35}]
["Fund Operators row count:",1]
["Count yellow in Standing Data:",2]
["Count yellow in Financial Data:"]
["IncludedInThisReturn",{"$f":"COUNTIF(Q1.3.18ii:INDIRECT(\"'Standing Data'!C\"&results!C2),\"Yes\")","v":0}]
[]
["Validation - Standing Data",{"$f":"ValidationError1","v":"THE FORM IS INCOMPLETE. PLEASE COMPLETE ALL HIGHLIGHTED (YELLOW) CELLS."}]
["Validation - Financial Data",{"$f":"ValidationError2","v":"THE FORM IS INCOMPLETE. PLEASE COMPLETE ALL HIGHLIGHTED (YELLOW) CELLS."}]
["Combined Validation",{"$f":"IF(AND(ValidationError1=\"READY TO SUBMIT.\", ValidationError2=\"READY TO SUBMIT.\"),\"READY TO SUBMIT.\", \"THE FORM IS INCOMPLETE. PLEASE COMPLETE ALL HIGHLIGHTED (YELLOW) CELLS.\")","v":"THE FORM IS INCOMPLETE. PLEASE COMPLETE ALL HIGHLIGHTED (YELLOW) CELLS."}]
[]
[]
["Q1.3.1",{"$f":"INDIRECT(A13)","v":0}]
["Q1.3.2",{"$f":"ISBLANK(INDIRECT(A14))","v":true}]
["Q1.3.3",{"$f":"ISBLANK(INDIRECT(A15))","v":true}]
["Standing Data'!B16",{"$f":"ISBLANK('Standing Data'!B16)","v":true}]
["Standing Data'!C16",{"$f":"ISBLANK('Standing Data'!C16)","v":true}]
["Q1.3.10",{"$f":"ISBLANK(INDIRECT(A18))","v":true}]
["Q1.3.11",{"$f":"ISBLANK(INDIRECT(A19))","v":true}]
["Q1.3",{"$f":"INDIRECT(A20)","v":0}]
["Q1.3.16",{"$f":"ISBLANK(INDIRECT(A21))","v":true}]
["Q1.3.17",{"$f":"ISBLANK(INDIRECT(A22))","v":true}]
["Standing Data'!B35",{"$f":"ISBLANK('Standing Data'!B35)","v":true}]
[]
[null,"Case 1","Case 2","Case 3","Case 4","Case 5","Case 6","Case 7","Case 8","Case 9","Case 10","Concat","Error Msg"]
["Q1.3.2",{"$f":"IF(AND(NOT(ISBLANK(Q1.3.2)),Q1.3.2<0),\" Number must be positive.\",\"\")","v":""},{"$f":"IF(AND(NOT(ISBLANK(Q1.3.2)),NOT(ISNUMBER(Q1.3.2))),\" Must be a number.\",\"\")","v":""},{"$f":"IF(AND(NOT(ISBLANK(Q1.3.2)),Q1.3.2<>CountFeederFunds),\" Check rows in 1.3.4.\",\"\")","v":""},null,null,null,null,null,null,null,{"$f":"B26&C26&D26&E26&F26&G26&H26&I26&J26&K26","v":""},{"$f":"IF(LEN(L26)<>0,\"Error : \"&L26,\"\")","v":""}]
["Q1.3.16",{"$f":"IF(AND(NOT(ISBLANK(Q1.3.16)),Q1.3.16<=0),\" Number must be positive.\",\"\")","v":""},{"$f":"IF(AND(NOT(ISBLANK(Q1.3.16)),NOT(ISNUMBER(Q1.3.16))),\" Must be a number.\",\"\")","v":""},null,null,null,null,null,null,null,null,{"$f":"B27&C27&D27&E27&F27&G27&H27&I27&J27&K27","v":""},{"$f":"IF(LEN(L27)<>0,\"Error : \"&L27,\"\")","v":""}]
["Q1.3.17",{"$f":"IF(AND(NOT(ISBLANK(Q1.3.17)),Q1.3.17<0),\" Number must be positive.\",\"\")","v":""},{"$f":"IF(AND(NOT(ISBLANK(Q1.3.17)),NOT(ISNUMBER(Q1.3.17))),\" Must be a number.\",\"\")","v":""},{"$f":"IF(AND(NOT(ISBLANK(Q1.3.17)),Q1.3.17<>IncludedInThisReturn),\" Check rows in 1.3.18 (Included…).\",\"\")","v":""},null,null,null,null,null,null,null,{"$f":"B28&C28&D28&E28&F28&G28&H28&I28&J28&K28","v":""},{"$f":"IF(LEN(L28)<>0,\"Error : \"&L28,\"\")","v":""}]